cradle novel wuxiaryobi 3200 cd

How to turn up a cobra 25 ltd classic

Automatic bios update lenovoWhat is an anti hero quizlet

Failed to create a chrome process selenium

Hackharhoaw3yk5q

Mar 15, 2014 · These answers are provided by our Community. If you find them useful, show some love by clicking the heart. If you run into issues leave a comment, or add your own answer to help others. Configuring Selenium 2.0 with Chrome to work in Visual Studio. In a previous post/video I showed how to get started using Selenium WebDriver for IE in Visual Studio.. Since then I've received a few questions on how to do the same with Selenium Web Driver and Chrome in Visual Studio. Jun 24, 2019 · Selenium Simple Click is not really reliable in React App in Chrome When Chrome was upgraded from v71 to v74, a lot of UI automation tests against React App failed because the element.Click() was not working properly.

Jun 21, 2018 · Selenium transformed the process of UI testing web applications by introducing the ability to automate tests. Over time, Selenium has developed to encompass a whole family of test automation tools. Selenium Grid is the newest of these, and in its current iteration, provides a powerful way to distribute your tests across a number of servers.

Sep 05, 2018 · Just in case someone ran in the same issue: I was running checks as jobs inside sidekiq and this created problems with threads, which in turn created a lot of delays in my app (needed to restart sidekiq process). IIRC, one common cause of 0xc0000022 when launching a process is that the process doesn't have sufficient access to the window station and/or desktop it is trying to run on. Do you know what security context selenium is trying to use to launch the process? Automating a login process using Selenium with Java or any other programming language is the very first step towards becoming a successful automation tester. Without further ado, let’s get started.

Jun 21, 2018 · Selenium transformed the process of UI testing web applications by introducing the ability to automate tests. Over time, Selenium has developed to encompass a whole family of test automation tools. Selenium Grid is the newest of these, and in its current iteration, provides a powerful way to distribute your tests across a number of servers.

May 02, 2012 · Where the IDE doesn`t help creating test cases, the developer can create them directly in Java. A benefit of Selenium is that you`ll end up having functional tests, as a real browser will make the calls to the application and validate the result. From the 21 tests in my test suite, 2 failed.

 

 

Legend of korra season 1 episode 1 full episode youtube

Formuler z7+ iptv setup

Picatinny rail barrel weightMcc tool chest ps4 to pc
How to execute Selenium Webdriver in Chrome Browser; Selenium Webdriver tutorial for beginners; How to Read and Write excel files in Selenium using Apache POI; How to Handle Dropdown in Selenium webdriver; How to Capture Screenshot in Selenium Webdriver and Use in Reporting; Step by Step guide for Advance Selenium Webdriver tutorial

Failed to create a chrome process selenium

Telugu movies free downloadRazer id login
Create an InternetExplorerDriverService and then use that to create a RemoteWebDriver.RemoteWebDriver(org.openqa.selenium.remote.CommandExecutor, Capabilities) with a DriverCommandExecutor. InternetExplorerDriver ( InternetExplorerDriverService service, InternetExplorerOptions options)

Failed to create a chrome process selenium

Drawing fingersVintage mopeds
This Docker Selenium Tutorial will explain to you more about what a Docker is and how we download, install, and integrate it with Selenium grid. Learn how to create a disposable Selenium Grid Infrastructure using Docker.

Failed to create a chrome process selenium

Historia ya wakilindiSingle story house plans autocad download
Very first thing to know before we move to this chapter is that this test won’t work, but this is just to give you a basic understanding of How a Selenium Test is written in Eclipse and the meaning of each and every line. In this chapter, we will write a very basic Selenium Test for Selenium Automation Testing and try to understand the following:

Failed to create a chrome process selenium

Good and evil articlesMapbox geojson label
I am running following python3 script on ubuntu import os from selenium import webdriver from selenium.webdriver.chrome.options import Options options = Options() options.add_argument('--headles...

Failed to create a chrome process selenium

Bbc afaan oromoo dubartootaaZandalari heritage armor quest
I'm looking to test against AWS in the Cloud and Trying to set up instances to use Selenoid instance of just the regular Selenium Grid. I create an AWS Instance, allow it to be paired with a Security Group that allows for SSH and HTTP access from anywhere, and set up selenoid and selenoid-ui using the following commands:

Failed to create a chrome process selenium

Revolute joint matlabAirpush detector xda
Sep 03, 2017 · The Chrome’s add-on platform was totally incompatible with the Firefox’s, and without any resource, there has not been a single attempt to port Selenium IDE to other web browsers.

Failed to create a chrome process selenium

13dp5dt beta lowTil ke baare mein
google-chrome, selenium, selenium-webdriver, webdriver answered by Pete Kelley on 05:08PM - 06 Jun 18 UTC In your test case’s script mode, you can try to initiate ChromeDriver with the above options, as demonstrated in this documentation.

Failed to create a chrome process selenium

Flutter stack positionedDanmachi volume 15 summary
Dec 21, 2014 · How to Record and Playback scripts using Selenium IDE Automation Made Easy. ... The power of Headless Chrome and browser automation ... 33:46. How to execute failed test cases in Selenium ...

Failed to create a chrome process selenium

Switzerland president 2020Solar river south australia
Selenium IDE is a Chrome and Firefox plugin that can log ‘natural’ interactions in the browser and generate its code in programming languages like C#, Java, Python, and Ruby, as well as Selenese (Selenium’s own scripting language).

Failed to create a chrome process selenium

Windows 10 background messed up
Mother beat child school administrator with belt

Redmi 6a baseband ic

Jan 15, 2018 · docker run -d -P selenium/standalone-chrome-debug Step 3: After running the Docker container we should verify the Container Process and Port Details. docker ps You can acquire the port by looking at the container details Like from the Image above we can see the VNC server is listening on the Port No: 32771. Start VNC and Create VNC:

Environment variables to be passed to browser container or driver process: 11: Optional. Custom /etc/hosts entries to be passed to browser container in hostname:ip format. 12: Optional. Shared memory size in bytes to be set for container. Some browsers (e.g. Chrome) may work unstable when having insufficient shmSize. Default value is 256 megabytes. 13: Optional.

Apr 29, 2018 · How things worked before Geckodriver and Selenium 3. If you are new to Selenium and you have started directly with Selenium 3.x, you would not know how Firefox was launched with the previous versions of Selenium (version 2.53 and before). It was a pretty straight forward process where you were not required to use Geckodriver or any other driver.

May 17, 2018 · Keeping this in mind, we have updated this article to help you download and install Selenium Webdriver 3.12.0. There are many different ways in which you can download and install Selenium WebDriver. This article will use the bare minimum tools/components that you will need to install the latest version of Selenium.

I'm getting this error: No such file or directory: 'chromedriver' while trying to run a selenium webdriver script. I have set up a virtual environment on a shared hosting account. My question is do I really need to have Chromedriver installed if I'm using Chrome when executing this script?

Free case study in retail management

Nov 10, 2018 · Selenium.Chrome.WebDriver. Updated .csproj file: Now after adding the selenium related packages the .csproj file will look like the below. Create and Run Selenium Tests: Now since everything is ready and set, we can create and run our selenium tests.

Jan 15, 2018 · docker run -d -P selenium/standalone-chrome-debug Step 3: After running the Docker container we should verify the Container Process and Port Details. docker ps You can acquire the port by looking at the container details Like from the Image above we can see the VNC server is listening on the Port No: 32771. Start VNC and Create VNC:

Automating a login process using Selenium with Java or any other programming language is the very first step towards becoming a successful automation tester. Without further ado, let’s get started.

Sep 21, 2014 · In this video we will cover how to click,type,dropdown using Selenium Webdriver. We will use eclipse,firebug,firepath,selenium Check out my blog as well http...

How can I open multiple chrome profile and each profile open the url as describle in video ! I’m using C# for selenium, chrome is version 68, chromedriver 2.41 ! Thanks !

Mar 16, 2015 · Both the Internet Explorer and Firefox driver are included in the Selenium, however we will need to download an additional web driver for Chrome . Once the web driver for chrome has been downloaded extract the executable file to a folder in your solution .

Configuring Selenium 2.0 with Chrome to work in Visual Studio. In a previous post/video I showed how to get started using Selenium WebDriver for IE in Visual Studio.. Since then I've received a few questions on how to do the same with Selenium Web Driver and Chrome in Visual Studio.

A soft assert will run the test and not throw an exception if the assert failed, while a hard assert will throw the exception immediately, and then continue with the testing process. Question 13: In your opinion, what are the main negative points of Selenium?

Nov 10, 2018 · Selenium.Chrome.WebDriver. Updated .csproj file: Now after adding the selenium related packages the .csproj file will look like the below. Create and Run Selenium Tests: Now since everything is ready and set, we can create and run our selenium tests.

Jan 26, 2019 · To create your first selenium webdriver script follow This Seven Basic Steps of Selenium Tests, There are seven basic steps in creating a Selenium test script, which apply to any test case and any application under test (AUT).

How to fake closure
  • When I run my program without any chrome processes active, it works. Another post said it was an issue with a non-default installation of the chrome binary, but my install was installed in the default location. When I run it with any chrome processes active it fails and gives this log:
  • Jun 21, 2018 · Selenium transformed the process of UI testing web applications by introducing the ability to automate tests. Over time, Selenium has developed to encompass a whole family of test automation tools. Selenium Grid is the newest of these, and in its current iteration, provides a powerful way to distribute your tests across a number of servers.
  • Chrome Driver, ERROR:process_metrics.cc ... (238)] Failed to create shader cache entry: -2 ... Nothing has changed in my usage of Selenium and Chrome Driver and the ...
  • After installing Katalon Studio v.5.8.2 to a co-workers laptop, when trying to run the test, test fails with this exception Test FAILED because (of) (Stack trace: com.kms.katalon.core.exception.StepFailedException: Unable to open browser with url: ‘’ (Root cause: org.openqa.selenium.WebDriverException: unknown error: chrome failed to start (Driver info: chromedriver=2.35.528161 ...
  • Mar 16, 2015 · Both the Internet Explorer and Firefox driver are included in the Selenium, however we will need to download an additional web driver for Chrome . Once the web driver for chrome has been downloaded extract the executable file to a folder in your solution .
  • Private label candles near me

  • So here you create two instances of WebDriver and each one will be operating with its own cookies set. I just checked that with amazon website since it uses sessions to track what you're doing on the site even if you're not logged in. Below is the output:
  • May 29, 2018 · In this post we will focusing on running testing scenarios on Chrome, Firefox, and Opera browsers simultaneously. We would be focusing on cross browsers issues along with functional issues. It will not only save your time and efforts but will also help you deliver a seamless experience to the user of your website.
  • Sep 05, 2018 · Just in case someone ran in the same issue: I was running checks as jobs inside sidekiq and this created problems with threads, which in turn created a lot of delays in my app (needed to restart sidekiq process).
  • Automating a login process using Selenium with Java or any other programming language is the very first step towards becoming a successful automation tester. Without further ado, let’s get started.
  • ensuring that a display is configured if your jenkins box is a headless machine. [ I am very sure that the reason behind your issues is because your LINUX box is a headless machine and thats why the browser start up conks.
  • Jun 17, 2019 · By having Selenium opening your Google Chrome Browser to mimic legitimate user browsing behaviors. By having Selenium pump all of the information into lists and csv files for you. Well you’re in luck, because all you need to do is write a simple Selenium script and you can now run the web scraping program while having a good night sleep.
Selenium IDE is a Chrome and Firefox plugin that can log ‘natural’ interactions in the browser and generate its code in programming languages like C#, Java, Python, and Ruby, as well as Selenese (Selenium’s own scripting language).
  • Cerita sex sedarah terbaru

  • Failed to create a chrome process selenium

  • Failed to create a chrome process selenium

  • Failed to create a chrome process selenium

  • Failed to create a chrome process selenium

  • Failed to create a chrome process selenium

  • Failed to create a chrome process selenium

  • Failed to create a chrome process selenium

  • Failed to create a chrome process selenium

Erich barretto age
Lubrizol tackifier
Django telegram bot tutorial
Columbia convocation 2019

Psychology chapter 3 sensation and perception quiz

Car inheritance hackerrank solution java